{"text_format":"1","workbook":"xlsx","n_sheets":4,"sheets":["Kryci list","Rekapitulace","Zakazka","Figury"],"not_rendered":{"charts":0,"images":0,"macros":0,"external_links":1,"defined_names":27,"comments":0,"pivot_tables":0},"unopened":[],"bounds":{"document_bytes":16777216,"sheet_cells":100000,"rows_first":2000,"rows_last":500,"rows_between":2000,"halvings":0,"cell_chars":16384,"cell_head_chars":4096},"cells_cut":0,"cells_raw":0,"read":"whole","date_system":"1900"}

{"sheet":"Kryci list","index":0,"n_rows":28,"n_cols":3,"rows_kept":28,"cut":false,"hidden":false,"merged":[[1,0,1,1],[24,0,24,1],[25,0,25,1],[26,0,26,1],[27,0,27,1]]}
[]
["Soupis stavebních prací, dodávek a služeb s výkazem výměr"]
["Zakázka"]
["Datum","2021-05-13"]
[]
["Zakázka","Rekonstrukce mostu DC-021 v ul. Revírní"]
[null,"ul. Revírní, Děčín XI (Horní Žleb)","CZK"]
[]
[]
[]
["Stavebník","Statutární město Děčín "]
[null,"magistrát města Děčín, Mírové nám. 1175/5"]
[null,"405 38 Děčín IV"]
[]
["Projektant","FIRAST s.r.o."]
[null,"V Korytech 972/12, 100 00 Praha 10"]
[null,"IČ: 26708167"]
[null,"Ing. Radek Boháč, Ing. Denisa Boháčová"]
[]
["Uchazeč"]
[]
["Stupeň dokumentace","DPS"]
["Fáze","Rozpočet pro výběr zhotovitele stavby"]
[]
["Celková nabídková cena musí obsahovat veškeré práce a dodávky nutné k řádnému a úplnému zhotovení předmětu plnění zakázky a jeho uvedení do provozu, které vyplývají ze zadávacích podmínek."]
["Sazby a ceny se zadávají (musí být uvedeny) ke každé položce výkazu výměr. Sazby zahrnují veškeré daně, cla a další závazky, které nejsou ve výkaze výměr a v nabídce uvedené zvlášť."]
["Zadavatel doporučuje uchazečům v případě rozporů mezi soupisem prací s výkazem výměr a projektovou dokumentací vyjasnit tuto situaci v průběhu soutěžní lhůty prostřednictvím žádosti o dodatečnou informaci."]
["Položky s číselným kódem jsou z cenové databáze ÚRS 2019-01, položky s R-kódem jsou tvořeny pomocí databáze vlastní."]

{"sheet":"Rekapitulace","index":1,"n_rows":35,"n_cols":6,"rows_kept":35,"cut":false,"hidden":false,"merged":[]}
[null,"Zakázka:"]
[{"$f":"INDEX(__SAZBA__,MATCH(0,COUNTIF($A$1:A1,__SAZBA__),0))","v":"_"},{"$f":"'Kryci list'!B6","v":"Rekonstrukce mostu DC-021 v ul. Revírní"}]
[{"$f":"INDEX(__SAZBA__,MATCH(0,COUNTIF($A$1:A2,__SAZBA__),0))","v":21},"Popis","Cena","Hmotnost","DPH","Cena s DPH"]
[{"$f":"INDEX(__SAZBA__,MATCH(0,COUNTIF($A$1:A3,__SAZBA__),0))","v":{"$error":"#N/A"}}]
[null,{"$f":"IF(Zakazka!$I$5=0,\"\",Zakazka!$I$5)","v":"SO_01: Rekonstrukce mostu"},{"$f":"IF(Zakazka!$O$5=0,\"\",Zakazka!$O$5)","v":""},{"$f":"IF(Zakazka!$Q$5=0,\"\",Zakazka!$Q$5)","v":118.15751121554996},{"$f":"IF(Zakazka!$U$5=0,\"\",Zakazka!$U$5)","v":""},{"$f":"IF(Zakazka!$V$5=0,\"\",Zakazka!$V$5)","v":""}]
[null,{"$f":"IF(Zakazka!$I$6=0,\"\",Zakazka!$I$6)","v":"001: Zemní práce"},{"$f":"IF(Zakazka!$O$6=0,\"\",Zakazka!$O$6)","v":""},{"$f":"IF(Zakazka!$Q$6=0,\"\",Zakazka!$Q$6)","v":7.4179500000000003},{"$f":"IF(Zakazka!$U$6=0,\"\",Zakazka!$U$6)","v":""},{"$f":"IF(Zakazka!$V$6=0,\"\",Zakazka!$V$6)","v":""}]
[null,{"$f":"IF(Zakazka!$I$48=0,\"\",Zakazka!$I$48)","v":"002: Základy"},{"$f":"IF(Zakazka!$O$48=0,\"\",Zakazka!$O$48)","v":""},{"$f":"IF(Zakazka!$Q$48=0,\"\",Zakazka!$Q$48)","v":24.045150399999997},{"$f":"IF(Zakazka!$U$48=0,\"\",Zakazka!$U$48)","v":""},{"$f":"IF(Zakazka!$V$48=0,\"\",Zakazka!$V$48)","v":""}]
[null,{"$f":"IF(Zakazka!$I$76=0,\"\",Zakazka!$I$76)","v":"003: Svislé konstrukce"},{"$f":"IF(Zakazka!$O$76=0,\"\",Zakazka!$O$76)","v":""},{"$f":"IF(Zakazka!$Q$76=0,\"\",Zakazka!$Q$76)","v":31.399118820550001},{"$f":"IF(Zakazka!$U$76=0,\"\",Zakazka!$U$76)","v":""},{"$f":"IF(Zakazka!$V$76=0,\"\",Zakazka!$V$76)","v":""}]
[null,{"$f":"IF(Zakazka!$I$132=0,\"\",Zakazka!$I$132)","v":"004: Vodorovné konstrukce"},{"$f":"IF(Zakazka!$O$132=0,\"\",Zakazka!$O$132)","v":""},{"$f":"IF(Zakazka!$Q$132=0,\"\",Zakazka!$Q$132)","v":17.703786722},{"$f":"IF(Zakazka!$U$132=0,\"\",Zakazka!$U$132)","v":""},{"$f":"IF(Zakazka!$V$132=0,\"\",Zakazka!$V$132)","v":""}]
[null,{"$f":"IF(Zakazka!$I$152=0,\"\",Zakazka!$I$152)","v":"005: Komunikace"},{"$f":"IF(Zakazka!$O$152=0,\"\",Zakazka!$O$152)","v":""},{"$f":"IF(Zakazka!$Q$152=0,\"\",Zakazka!$Q$152)","v":31.445534000000006},{"$f":"IF(Zakazka!$U$152=0,\"\",Zakazka!$U$152)","v":""},{"$f":"IF(Zakazka!$V$152=0,\"\",Zakazka!$V$152)","v":""}]
[null,{"$f":"IF(Zakazka!$I$167=0,\"\",Zakazka!$I$167)","v":"006: Úpravy povrchu"},{"$f":"IF(Zakazka!$O$167=0,\"\",Zakazka!$O$167)","v":""},{"$f":"IF(Zakazka!$Q$167=0,\"\",Zakazka!$Q$167)","v":1.9726024479999997},{"$f":"IF(Zakazka!$U$167=0,\"\",Zakazka!$U$167)","v":""},{"$f":"IF(Zakazka!$V$167=0,\"\",Zakazka!$V$167)","v":""}]
[null,{"$f":"IF(Zakazka!$I$188=0,\"\",Zakazka!$I$188)","v":"009: Ostatní konstrukce a práce"},{"$f":"IF(Zakazka!$O$188=0,\"\",Zakazka!$O$188)","v":""},{"$f":"IF(Zakazka!$Q$188=0,\"\",Zakazka!$Q$188)","v":4.1717117249999998},{"$f":"IF(Zakazka!$U$188=0,\"\",Zakazka!$U$188)","v":""},{"$f":"IF(Zakazka!$V$188=0,\"\",Zakazka!$V$188)","v":""}]
[null,{"$f":"IF(Zakazka!$I$230=0,\"\",Zakazka!$I$230)","v":"099: Přesun hmot HSV"},{"$f":"IF(Zakazka!$O$230=0,\"\",Zakazka!$O$230)","v":""},{"$f":"IF(Zakazka!$Q$230=0,\"\",Zakazka!$Q$230)","v":""},{"$f":"IF(Zakazka!$U$230=0,\"\",Zakazka!$U$230)","v":""},{"$f":"IF(Zakazka!$V$230=0,\"\",Zakazka!$V$230)","v":""}]
[null,{"$f":"IF(Zakazka!$I$238=0,\"\",Zakazka!$I$238)","v":"711: Izolace proti vodě"},{"$f":"IF(Zakazka!$O$238=0,\"\",Zakazka!$O$238)","v":""},{"$f":"IF(Zakazka!$Q$238=0,\"\",Zakazka!$Q$238)","v":""},{"$f":"IF(Zakazka!$U$238=0,\"\",Zakazka!$U$238)","v":""},{"$f":"IF(Zakazka!$V$238=0,\"\",Zakazka!$V$238)","v":""}]
[null,{"$f":"IF(Zakazka!$I$244=0,\"\",Zakazka!$I$244)","v":"767: Konstrukce zámečnické"},{"$f":"IF(Zakazka!$O$244=0,\"\",Zakazka!$O$244)","v":""},{"$f":"IF(Zakazka!$Q$244=0,\"\",Zakazka!$Q$244)","v":1.6570999999999999E-3},{"$f":"IF(Zakazka!$U$244=0,\"\",Zakazka!$U$244)","v":""},{"$f":"IF(Zakazka!$V$244=0,\"\",Zakazka!$V$244)","v":""}]
[null,{"$f":"IF(Zakazka!$I$263=0,\"\",Zakazka!$I$263)","v":"SO_02: Zpevnění svahu a oplocení"},{"$f":"IF(Zakazka!$O$263=0,\"\",Zakazka!$O$263)","v":""},{"$f":"IF(Zakazka!$Q$263=0,\"\",Zakazka!$Q$263)","v":128.4701436},{"$f":"IF(Zakazka!$U$263=0,\"\",Zakazka!$U$263)","v":""},{"$f":"IF(Zakazka!$V$263=0,\"\",Zakazka!$V$263)","v":""}]
[null,{"$f":"IF(Zakazka!$I$264=0,\"\",Zakazka!$I$264)","v":"001: Zemní práce"},{"$f":"IF(Zakazka!$O$264=0,\"\",Zakazka!$O$264)","v":""},{"$f":"IF(Zakazka!$Q$264=0,\"\",Zakazka!$Q$264)","v":2.0602999999999998},{"$f":"IF(Zakazka!$U$264=0,\"\",Zakazka!$U$264)","v":""},{"$f":"IF(Zakazka!$V$264=0,\"\",Zakazka!$V$264)","v":""}]
[null,{"$f":"IF(Zakazka!$I$304=0,\"\",Zakazka!$I$304)","v":"002: Základy"},{"$f":"IF(Zakazka!$O$304=0,\"\",Zakazka!$O$304)","v":""},{"$f":"IF(Zakazka!$Q$304=0,\"\",Zakazka!$Q$304)","v":16.515993600000002},{"$f":"IF(Zakazka!$U$304=0,\"\",Zakazka!$U$304)","v":""},{"$f":"IF(Zakazka!$V$304=0,\"\",Zakazka!$V$304)","v":""}]
[null,{"$f":"IF(Zakazka!$I$317=0,\"\",Zakazka!$I$317)","v":"003: Svislé konstrukce"},{"$f":"IF(Zakazka!$O$317=0,\"\",Zakazka!$O$317)","v":""},{"$f":"IF(Zakazka!$Q$317=0,\"\",Zakazka!$Q$317)","v":109.89384999999999},{"$f":"IF(Zakazka!$U$317=0,\"\",Zakazka!$U$317)","v":""},{"$f":"IF(Zakazka!$V$317=0,\"\",Zakazka!$V$317)","v":""}]
[null,{"$f":"IF(Zakazka!$I$331=0,\"\",Zakazka!$I$331)","v":"009: Ostatní konstrukce a práce"},{"$f":"IF(Zakazka!$O$331=0,\"\",Zakazka!$O$331)","v":""},{"$f":"IF(Zakazka!$Q$331=0,\"\",Zakazka!$Q$331)","v":""},{"$f":"IF(Zakazka!$U$331=0,\"\",Zakazka!$U$331)","v":""},{"$f":"IF(Zakazka!$V$331=0,\"\",Zakazka!$V$331)","v":""}]
[null,{"$f":"IF(Zakazka!$I$340=0,\"\",Zakazka!$I$340)","v":"099: Přesun hmot HSV"},{"$f":"IF(Zakazka!$O$340=0,\"\",Zakazka!$O$340)","v":""},{"$f":"IF(Zakazka!$Q$340=0,\"\",Zakazka!$Q$340)","v":""},{"$f":"IF(Zakazka!$U$340=0,\"\",Zakazka!$U$340)","v":""},{"$f":"IF(Zakazka!$V$340=0,\"\",Zakazka!$V$340)","v":""}]
[null,{"$f":"IF(Zakazka!$I$349=0,\"\",Zakazka!$I$349)","v":"SO_03: Úprava dlažby pod drážním tělesem"},{"$f":"IF(Zakazka!$O$349=0,\"\",Zakazka!$O$349)","v":""},{"$f":"IF(Zakazka!$Q$349=0,\"\",Zakazka!$Q$349)","v":57.408531799999999},{"$f":"IF(Zakazka!$U$349=0,\"\",Zakazka!$U$349)","v":""},{"$f":"IF(Zakazka!$V$349=0,\"\",Zakazka!$V$349)","v":""}]
[null,{"$f":"IF(Zakazka!$I$350=0,\"\",Zakazka!$I$350)","v":"001: Zemní práce"},{"$f":"IF(Zakazka!$O$350=0,\"\",Zakazka!$O$350)","v":""},{"$f":"IF(Zakazka!$Q$350=0,\"\",Zakazka!$Q$350)","v":""},{"$f":"IF(Zakazka!$U$350=0,\"\",Zakazka!$U$350)","v":""},{"$f":"IF(Zakazka!$V$350=0,\"\",Zakazka!$V$350)","v":""}]
[null,{"$f":"IF(Zakazka!$I$371=0,\"\",Zakazka!$I$371)","v":"002: Základy"},{"$f":"IF(Zakazka!$O$371=0,\"\",Zakazka!$O$371)","v":""},{"$f":"IF(Zakazka!$Q$371=0,\"\",Zakazka!$Q$371)","v":2.2947918},{"$f":"IF(Zakazka!$U$371=0,\"\",Zakazka!$U$371)","v":""},{"$f":"IF(Zakazka!$V$371=0,\"\",Zakazka!$V$371)","v":""}]
[null,{"$f":"IF(Zakazka!$I$380=0,\"\",Zakazka!$I$380)","v":"005: Komunikace"},{"$f":"IF(Zakazka!$O$380=0,\"\",Zakazka!$O$380)","v":""},{"$f":"IF(Zakazka!$Q$380=0,\"\",Zakazka!$Q$380)","v":43.013739999999999},{"$f":"IF(Zakazka!$U$380=0,\"\",Zakazka!$U$380)","v":""},{"$f":"IF(Zakazka!$V$380=0,\"\",Zakazka!$V$380)","v":""}]
[null,{"$f":"IF(Zakazka!$I$389=0,\"\",Zakazka!$I$389)","v":"009: Ostatní konstrukce a práce"},{"$f":"IF(Zakazka!$O$389=0,\"\",Zakazka!$O$389)","v":""},{"$f":"IF(Zakazka!$Q$389=0,\"\",Zakazka!$Q$389)","v":12.1},{"$f":"IF(Zakazka!$U$389=0,\"\",Zakazka!$U$389)","v":""},{"$f":"IF(Zakazka!$V$389=0,\"\",Zakazka!$V$389)","v":""}]
[null,{"$f":"IF(Zakazka!$I$404=0,\"\",Zakazka!$I$404)","v":"099: Přesun hmot HSV"},{"$f":"IF(Zakazka!$O$404=0,\"\",Zakazka!$O$404)","v":""},{"$f":"IF(Zakazka!$Q$404=0,\"\",Zakazka!$Q$404)","v":""},{"$f":"IF(Zakazka!$U$404=0,\"\",Zakazka!$U$404)","v":""},{"$f":"IF(Zakazka!$V$404=0,\"\",Zakazka!$V$404)","v":""}]
[null,{"$f":"IF(Zakazka!$I$409=0,\"\",Zakazka!$I$409)","v":"VRN: Vedlejší rozpočtové náklady"},{"$f":"IF(Zakazka!$O$409=0,\"\",Zakazka!$O$409)","v":""},{"$f":"IF(Zakazka!$Q$409=0,\"\",Zakazka!$Q$409)","v":""},{"$f":"IF(Zakazka!$U$409=0,\"\",Zakazka!$U$409)","v":""},{"$f":"IF(Zakazka!$V$409=0,\"\",Zakazka!$V$409)","v":""}]
[null,{"$f":"IF(Zakazka!$I$410=0,\"\",Zakazka!$I$410)","v":"VRN: Vedlejší rozpočtové náklady"},{"$f":"IF(Zakazka!$O$410=0,\"\",Zakazka!$O$410)","v":""},{"$f":"IF(Zakazka!$Q$410=0,\"\",Zakazka!$Q$410)","v":""},{"$f":"IF(Zakazka!$U$410=0,\"\",Zakazka!$U$410)","v":""},{"$f":"IF(Zakazka!$V$410=0,\"\",Zakazka!$V$410)","v":""}]
[]
[{"$f":"SUM(A33:A34)","v":0},"Celkem (bez DPH)",{"$f":"SUBTOTAL(9,C5:C30)/2","v":0}]
[null,"DPH",{"$f":"SUBTOTAL(9,C33:C34)","v":0}]
[{"$f":"IF(ISNUMBER(A3),SUMIF(__SAZBA__,A3,__CENA__),0)","v":0},{"$f":"IF(A33=0,\"\",\"DPH \" & A3 & \" % ze základny: \" & TEXT(A33,\"# ##0\"))","v":""},{"$f":"IF(A33=0,\"\",A33*A3/100)","v":""}]
[{"$f":"IF(ISNUMBER(A4),SUMIF(__SAZBA__,A4,__CENA__),0)","v":0},{"$f":"IF(A34=0,\"\",\"DPH \" & A4 & \" % ze základny: \" & TEXT(A34,\"# ##0\"))","v":""},{"$f":"IF(A34=0,\"\",A34*A4/100)","v":""}]
[null,"Celkem (včetně DPH)",{"$f":"SUM(C31:C32)","v":0},{"$f":"#REF!","v":{"$error":"#REF!"}}]

{"sheet":"Zakazka","index":2,"n_rows":425,"n_cols":25,"rows_kept":425,"cut":false,"hidden":false,"merged":[]}
[]
[]
[null,null,null,null,null,"Poř.","Typ","Kód","Popis","MJ","Výměra bez ztr.","Ztratné","Výměra","Jedn. cena","Cena","Jedn. hmotn.","Hmotnost","Jedn. suť","Suť","Sazba DPH","DPH","Cena s DPH","Komentář","Objekt","Oddíl"]
[]
[null,null,null,null,null,null,null,null,"SO_01: Rekonstrukce mostu",null,null,null,null,null,{"$f":"SUBTOTAL(9,O6:O262)","v":0},null,{"$f":"SUBTOTAL(9,Q6:Q262)","v":118.15751121554996},null,{"$f":"SUBTOTAL(9,S6:S262)","v":77.865899999999996},"_",{"$f":"SUBTOTAL(9,U6:U262)","v":0},{"$f":"SUBTOTAL(9,V6:V262)","v":0}]
[null,null,null,null,null,null,null,null,"001: Zemní práce",null,null,null,null,null,{"$f":"SUBTOTAL(9,O7:O47)","v":0},null,{"$f":"SUBTOTAL(9,Q7:Q47)","v":7.4179500000000003},null,{"$f":"SUBTOTAL(9,S7:S47)","v":8.2279999999999998},"_",{"$f":"SUBTOTAL(9,U7:U47)","v":0},{"$f":"SUBTOTAL(9,V7:V47)","v":0}]
["##T2##N_Catalog_catGUID","##T2##PRO_ITEM_catID","##T2##PRO_ITEM_iteCode","##T2##PRO_ITEM_szvCode","##T2##PRO_ITEM_tevCode",1,"SP","113107342","Odstranění podkladu živičného tl 100 mm strojně pl do 50 m2","m2",37.4,0,{"$f":"K7*(1+L7/100)","v":37.4},null,{"$f":"M7*N7","v":0},null,{"$f":"M7*P7","v":0},0.22,{"$f":"M7*R7","v":8.2279999999999998},21,{"$f":"O7*(T7/100)","v":0},{"$f":"O7+U7","v":0},null,"SO_01","001"]
[null,null,null,null,null,null,null,null,"Stávající přilehlá komunikace",null,0,null,null,null,null,null,null,null,null,"_"]
[null,null,null,null,null,null,null,null,"16,5+20,9",null,37.4,null,null,null,null,null,null,null,null,"_"]
[null,null,null,null,null,2,"SP","122202201","Odkopávky a prokopávky nezapažené pro silnice objemu do 100 m3 v hornině tř. 3","m3",17.72,0,{"$f":"K10*(1+L10/100)","v":17.72},null,{"$f":"M10*N10","v":0},null,{"$f":"M10*P10","v":0},null,{"$f":"M10*R10","v":0},21,{"$f":"O10*(T10/100)","v":0},{"$f":"O10+U10","v":0},null,"SO_01","001"]
[null,null,null,null,null,null,null,null,"Kufr pro novou vozovku",null,0,null,null,null,null,null,null,null,null,"_"]
[null,null,null,null,null,null,null,null,"(26,0+18,3)*0,4",null,17.72,null,null,null,null,null,null,null,null,"_"]
[null,null,null,null,null,3,"SP","122201109","Příplatek za lepivost u odkopávek v hornině tř. 1 až 3","m3",17.72,0,{"$f":"K13*(1+L13/100)","v":17.72},null,{"$f":"M13*N13","v":0},null,{"$f":"M13*P13","v":0},null,{"$f":"M13*R13","v":0},21,{"$f":"O13*(T13/100)","v":0},{"$f":"O13+U13","v":0},null,"SO_01","001"]
[null,null,null,null,null,4,"SP","131201101","Hloubení jam nezapažených v hornině tř. 3 objemu do 100 m3","m3",21,0,{"$f":"K14*(1+L14/100)","v":21},null,{"$f":"M14*N14","v":0},null,{"$f":"M14*P14","v":0},null,{"$f":"M14*R14","v":0},21,{"$f":"O14*(T14/100)","v":0},{"$f":"O14+U14","v":0},null,"SO_01","001"]
[null,null,null,null,null,null,null,null,"Podél opěr, odpočteny odkopávky",null,0,null,null,null,null,null,null,null,null,"_"]
[null,null,null,null,null,null,null,null,"(0,8+1,3)*5,0*2",null,21,null,null,null,null,null,null,null,null,"_"]
[null,null,null,null,null,5,"SP","131201109","Příplatek za lepivost u hloubení jam nezapažených v hornině tř. 3","m3",21,0,{"$f":"K17*(1+L17/100)","v":21},null,{"$f":"M17*N17","v":0},null,{"$f":"M17*P17","v":0},null,{"$f":"M17*R17","v":0},21,{"$f":"O17*(T17/100)","v":0},{"$f":"O17+U17","v":0},null,"SO_01","001"]
[null,null,null,null,null,6,"SP","182101101","Svahování v zářezech v hornině tř. 1 až 4","m2",16.7,0,{"$f":"K18*(1+L18/100)","v":16.7},null,{"$f":"M18*N18","v":0},null,{"$f":"M18*P18","v":0},null,{"$f":"M18*R18","v":0},21,{"$f":"O18*(T18/100)","v":0},{"$f":"O18+U18","v":0},null,"SO_01","001"]
[null,null,null,null,null,null,null,null,"1,67*5,0*2",null,16.7,null,null,null,null,null,null,null,null,"_"]
[null,null,null,null,null,7,"SP","174101101","Zásyp jam, šachet rýh nebo kolem objektů sypaninou se zhutněním","m3",21,0,{"$f":"K20*(1+L20/100)","v":21},null,{"$f":"M20*N20","v":0},null,{"$f":"M20*P20","v":0},null,{"$f":"M20*R20","v":0},21,{"$f":"O20*(T20/100)","v":0},{"$f":"O20+U20","v":0},null,"SO_01","001"]
[null,null,null,null,null,null,null,null,"Původní zeminou - tl. vrstvy max 300mm",null,0,null,null,null,null,null,null,null,null,"_"]
[null,null,null,null,null,null,null,null,"21,0-4,0",null,17,null,null,null,null,null,null,null,null,"_"]
[null,null,null,null,null,null,null,null,"Štěrk",null,0,null,null,null,null,null,null,null,null,"_"]
[null,null,null,null,null,null,null,null,"(0,2+0,2)*5,0*2",null,4,null,null,null,null,null,null,null,null,"_"]
[null,null,null,null,null,8,"H","58344197","štěrkodrť frakce 0/63","t",6.72,10,{"$f":"K25*(1+L25/100)","v":7.3920000000000003},null,{"$f":"M25*N25","v":0},1,{"$f":"M25*P25","v":7.3920000000000003},null,{"$f":"M25*R25","v":0},21,{"$f":"O25*(T25/100)","v":0},{"$f":"O25+U25","v":0},null,"SO_01","001"]
[null,null,null,null,null,null,null,null,"20% na zhutnění",null,0,null,null,null,null,null,null,null,null,"_"]
[null,null,null,null,null,null,null,null,"4,0*1,4*1,2",null,6.72,null,null,null,null,null,null,null,null,"_"]
[null,null,null,null,null,9,"SP","162201102","Vodorovné přemístění do 50 m výkopku/sypaniny z horniny tř. 1 až 4","m3",71.664000000000001,0,{"$f":"K28*(1+L28/100)","v":71.664000000000001},null,{"$f":"M28*N28","v":0},null,{"$f":"M28*P28","v":0},null,{"$f":"M28*R28","v":0},21,{"$f":"O28*(T28/100)","v":0},{"$f":"O28+U28","v":0},null,"SO_01","001"]
[null,null,null,null,null,null,null,null,"KN=1,2",null,0,null,null,null,null,null,null,null,null,"_"]
[null,null,null,null,null,null,null,null,"Na meziskládku; (17,72+21,0)*1,2",null,46.463999999999999,null,null,null,null,null,null,null,null,"_"]
[null,null,null,null,null,null,null,null,"Zpět k zásypům; 21,0*1,2",null,25.2,null,null,null,null,null,null,null,null,"_"]
[null,null,null,null,null,10,"SP","167101101","Nakládání výkopku z hornin tř. 1 až 4 do 100 m3","m3",46.463999999999999,0,{"$f":"K32*(1+L32/100)","v":46.463999999999999},null,{"$f":"M32*N32","v":0},null,{"$f":"M32*P32","v":0},null,{"$f":"M32*R32","v":0},21,{"$f":"O32*(T32/100)","v":0},{"$f":"O32+U32","v":0},null,"SO_01","001"]
[null,null,null,null,null,11,"SP","162701105","Vodorovné přemístění do 10000 m výkopku/sypaniny z horniny tř. 1 až 4","m3",21.263999999999999,0,{"$f":"K33*(1+L33/100)","v":21.263999999999999},null,{"$f":"M33*N33","v":0},null,{"$f":"M33*P33","v":0},null,{"$f":"M33*R33","v":0},21,{"$f":"O33*(T33/100)","v":0},{"$f":"O33+U33","v":0},null,"SO_01","001"]
[null,null,null,null,null,null,null,null,"17,72*1,2",null,21.263999999999999,null,null,null,null,null,null,null,null,"_"]
[null,null,null,null,null,12,"SP","162701109","Příplatek k vodorovnému přemístění výkopku/sypaniny z horniny tř. 1 až 4 ZKD 1000 m přes 10000 m","m3",616.65599999999995,0,{"$f":"K35*(1+L35/100)","v":616.65599999999995},null,{"$f":"M35*N35","v":0},null,{"$f":"M35*P35","v":0},null,{"$f":"M35*R35","v":0},21,{"$f":"O35*(T35/100)","v":0},{"$f":"O35+U35","v":0},null,"SO_01","001"]
[null,null,null,null,null,null,null,null,"Předpoklad 39km vzdálená skládka",null,0,null,null,null,null,null,null,null,null,"_"]
[null,null,null,null,null,null,null,null,"29*21,264",null,616.65599999999995,null,null,null,null,null,null,null,null,"_"]
[null,null,null,null,null,13,"SP","171201201","Uložení sypaniny na skládky","m3",21.263999999999999,0,{"$f":"K38*(1+L38/100)","v":21.263999999999999},null,{"$f":"M38*N38","v":0},null,{"$f":"M38*P38","v":0},null,{"$f":"M38*R38","v":0},21,{"$f":"O38*(T38/100)","v":0},{"$f":"O38+U38","v":0},null,"SO_01","001"]
[null,null,null,null,null,14,"SP","171201211","Poplatek za uložení stavebního odpadu - zeminy a kameniva na skládce","t",28.352,0,{"$f":"K39*(1+L39/100)","v":28.352},null,{"$f":"M39*N39","v":0},null,{"$f":"M39*P39","v":0},null,{"$f":"M39*R39","v":0},21,{"$f":"O39*(T39/100)","v":0},{"$f":"O39+U39","v":0},null,"SO_01","001"]
[null,null,null,null,null,null,null,null,"1,6t/m3 v rostlém stavu",null,0,null,null,null,null,null,null,null,null,"_"]
[null,null,null,null,null,null,null,null,"21,264/1,2*1,6",null,28.352,null,null,null,null,null,null,null,null,"_"]
[null,null,null,null,null,15,"SP","183405211","Výsev trávníku hydroosevem na ornici","m2",20,0,{"$f":"K42*(1+L42/100)","v":20},null,{"$f":"M42*N42","v":0},1.2700000000000001E-3,{"$f":"M42*P42","v":2.5400000000000002E-2},null,{"$f":"M42*R42","v":0},21,{"$f":"O42*(T42/100)","v":0},{"$f":"O42+U42","v":0},null,"SO_01","001"]
[null,null,null,null,null,16,"H","00572410","osivo směs travní parková","kg",0.5,10,{"$f":"K43*(1+L43/100)","v":0.55000000000000004},null,{"$f":"M43*N43","v":0},1E-3,{"$f":"M43*P43","v":5.5000000000000003E-4},null,{"$f":"M43*R43","v":0},21,{"$f":"O43*(T43/100)","v":0},{"$f":"O43+U43","v":0},null,"SO_01","001"]
[null,null,null,null,null,null,null,null,"0,025kg/m2 ",null,0,null,null,null,null,null,null,null,null,"_"]
[null,null,null,null,null,null,null,null,"20,0*0,025",null,0.5,null,null,null,null,null,null,null,null,"_"]
[null,null,null,null,null,17,"SP","18580431R","Pravidelné kropení vysetého trávníku po dobu 14 dnů od osetí","Kč",1,0,{"$f":"K46*(1+L46/100)","v":1},null,{"$f":"M46*N46","v":0},null,{"$f":"M46*P46","v":0},null,{"$f":"M46*R46","v":0},21,{"$f":"O46*(T46/100)","v":0},{"$f":"O46+U46","v":0},null,"SO_01","001"]
[null,null,null,null,null,null,null,null,null,null,null,null,null,null,null,null,null,null,null,"_"]
[null,null,null,null,null,null,null,null,"002: Základy",null,null,null,null,null,{"$f":"SUBTOTAL(9,O49:O75)","v":0},null,{"$f":"SUBTOTAL(9,Q49:Q75)","v":24.045150399999997},null,{"$f":"SUBTOTAL(9,S49:S75)","v":2.5760000000000001},"_",{"$f":"SUBTOTAL(9,U49:U75)","v":0},{"$f":"SUBTOTAL(9,V49:V75)","v":0}]
[null,null,null,null,null,18,"SP","977151123","Jádrové vrty diamantovými korunkami do D 150 mm do stavebních materiálů","m",36.799999999999997,0,{"$f":"K49*(1+L49/100)","v":36.799999999999997},null,{"$f":"M49*N49","v":0},1.2199999999999999E-3,{"$f":"M49*P49","v":4.4895999999999991E-2},7.0000000000000007E-2,{"$f":"M49*R49","v":2.5760000000000001},21,{"$f":"O49*(T49/100)","v":0},{"$f":"O49+U49","v":0},null,"SO_01","002"]
[null,null,null,null,null,null,null,null,"Přes opěry, hluché vrtání",null,0,null,null,null,null,null,null,null,null,"_"]
[null,null,null,null,null,null,null,null,"4*5,0",null,20,null,null,null,null,null,null,null,null,"_"]
[null,null,null,null,null,null,null,null,"4*4,2",null,16.8,null,null,null,null,null,null,null,null,"_"]
[null,null,null,null,null,19,"SP","224312216","Vrty maloprofilové D do 156 mm úklon přes 45° hl do 50 m hor. V a VI","m",6,0,{"$f":"K53*(1+L53/100)","v":6},null,{"$f":"M53*N53","v":0},4.6000000000000001E-4,{"$f":"M53*P53","v":2.7600000000000003E-3},null,{"$f":"M53*R53","v":0},21,{"$f":"O53*(T53/100)","v":0},{"$f":"O53+U53","v":0},null,"SO_01","002"]
[null,null,null,null,null,null,null,null,"Hluché vrtání, zemina",null,0,null,null,null,null,null,null,null,null,"_"]
[null,null,null,null,null,null,null,null,"0,6*4",null,2.4,null,null,null,null,null,null,null,null,"_"]
[null,null,null,null,null,null,null,null,"0,9*4",null,3.6,null,null,null,null,null,null,null,null,"_"]
[null,null,null,null,null,20,"SP","283111112","Zřízení trubkových mikropilot svislých část hladká D 105 mm","m",42.8,0,{"$f":"K57*(1+L57/100)","v":42.8},null,{"$f":"M57*N57","v":0},3.7010000000000001E-2,{"$f":"M57*P57","v":1.584028},null,{"$f":"M57*R57","v":0},21,{"$f":"O57*(T57/100)","v":0},{"$f":"O57+U57","v":0},null,"SO_01","002"]
[null,null,null,null,null,null,null,null,"5,5*4+5,2*4",null,42.8,null,null,null,null,null,null,null,null,"_"]
[null,null,null,null,null,21,"H","1401106R","trubka ocelová bezešvá hladká jakost 11 523 89x10mm","m",42.8,10,{"$f":"K59*(1+L59/100)","v":47.08},null,{"$f":"M59*N59","v":0},1.9480000000000001E-2,{"$f":"M59*P59","v":0.9171184},null,{"$f":"M59*R59","v":0},21,{"$f":"O59*(T59/100)","v":0},{"$f":"O59+U59","v":0},null,"SO_01","002"]
[null,null,null,null,null,22,"SP","281602111","Injektování povrchové nízkotlaké s dvojitým obturátorem mikropilot a kotev tlakem do 0,6 MPa","hod",16,0,{"$f":"K60*(1+L60/100)","v":16},null,{"$f":"M60*N60","v":0},1.3999999999999999E-4,{"$f":"M60*P60","v":2.2399999999999998E-3},null,{"$f":"M60*R60","v":0},21,{"$f":"O60*(T60/100)","v":0},{"$f":"O60+U60","v":0},null,"SO_01","002"]
{"$rows_left_out":366}
{"sheet":"Figury","index":3,"n_rows":1,"n_cols":4,"rows_kept":1,"cut":false,"hidden":true,"merged":[]}
["Figura","Výraz","Hodnota","Popis"]